Diffusion Krita adf027104b07

Try to fix the the jenkins build

Authored by rempt on Apr 22 2019, 11:00 AM.

Description

Try to fix the the jenkins build

[2019-04-22T08:29:04.736Z] Scanning dependencies of target KisCompositionBenchmark
[2019-04-22T08:29:04.993Z] [ 43%] Building CXX object benchmarks/CMakeFiles/KisCompositionBenchmark.dir/kis_composition_benchmark.cpp.o
[2019-04-22T08:29:07.539Z] In file included from /usr/include/boost/random/detail/integer_log2.hpp:19,
[2019-04-22T08:29:07.539Z] from /usr/include/boost/random/detail/large_arithmetic.hpp:19,
[2019-04-22T08:29:07.539Z] from /usr/include/boost/random/detail/const_mod.hpp:23,
[2019-04-22T08:29:07.539Z] from /usr/include/boost/random/detail/seed_impl.hpp:26,
[2019-04-22T08:29:07.539Z] from /usr/include/boost/random/mersenne_twister.hpp:30,
[2019-04-22T08:29:07.539Z] from /home/jenkins/workspace/Extragear/krita/kf5-qt5 SUSEQt5.10/benchmarks/kis_composition_benchmark.cpp:92:
[2019-04-22T08:29:07.539Z] /usr/include/boost/pending/integer_log2.hpp:7:59: note: #pragma message: This header is deprecated. Use <boost/integer/integer_log2.hpp> instead.
[2019-04-22T08:29:07.539Z] BOOST_HEADER_DEPRECATED("<boost/integer/integer_log2.hpp>");
[2019-04-22T08:29:07.540Z] ^
[2019-04-22T08:29:07.540Z] /home/jenkins/workspace/Extragear/krita/kf5-qt5 SUSEQt5.10/benchmarks/kis_composition_benchmark.cpp: In member function ���void KisCompositionBenchmark::compareAlphaDarkenOps()���:
[2019-04-22T08:29:07.540Z] /home/jenkins/workspace/Extragear/krita/kf5-qt5 SUSEQt5.10/benchmarks/kis_composition_benchmark.cpp:645:72: error: ���KoAlphaDarkenParamsWrapperCreamy��� was not declared in this scope
[2019-04-22T08:29:07.540Z] KoCompositeOp *opExp = new KoCompositeOpAlphaDarken<KoBgrU8Traits, KoAlphaDarkenParamsWrapperCreamy>(cs);
[2019-04-22T08:29:07.540Z] ^~~~~~~~~~~~~~~~~~~~~~~~~~~~~~~~
[2019-04-22T08:29:07.540Z] /home/jenkins/workspace/Extragear/krita/kf5-qt5 SUSEQt5.10/benchmarks/kis_composition_benchmark.cpp:645:104: error: template argument 2 is invalid
[2019-04-22T08:29:07.540Z] KoCompositeOp *opExp = new KoCompositeOpAlphaDarken<KoBgrU8Traits, KoAlphaDarkenParamsWrapperCreamy>(cs);
[2019-04-22T08:29:07.540Z] ^
[2019-04-22T08:29:07.540Z] /home/jenkins/workspace/Extragear/krita/kf5-qt5 SUSEQt5.10/benchmarks/kis_composition_benchmark.cpp: In member function ���void KisCompositionBenchmark::compareRgbF32AlphaDarkenOps()���:
[2019-04-22T08:29:07.540Z] /home/jenkins/workspace/Extragear/krita/kf5-qt5 SUSEQt5.10/benchmarks/kis_composition_benchmark.cpp:657:73: error: ���KoAlphaDarkenParamsWrapperCreamy��� was not declared in this scope
[2019-04-22T08:29:07.540Z] KoCompositeOp *opExp = new KoCompositeOpAlphaDarken<KoRgbF32Traits, KoAlphaDarkenParamsWrapperCreamy>(cs);
[2019-04-22T08:29:07.540Z] ^~~~~~~~~~~~~~~~~~~~~~~~~~~~~~~~
[2019-04-22T08:29:07.540Z] /home/jenkins/workspace/Extragear/krita/kf5-qt5 SUSEQt5.10/benchmarks/kis_composition_benchmark.cpp:657:105: error: template argument 2 is invalid
[2019-04-22T08:29:07.540Z] KoCompositeOp *opExp = new KoCompositeOpAlphaDarken<KoRgbF32Traits, KoAlphaDarkenParamsWrapperCreamy>(cs);
[2019-04-22T08:29:07.540Z] ^
[2019-04-22T08:29:07.540Z] /home/jenkins/workspace/Extragear/krita/kf5-qt5 SUSEQt5.10/benchmarks/kis_composition_benchmark.cpp: In member function ���void KisCompositionBenchmark::compareAlphaDarkenOpsNoMask()���:
[2019-04-22T08:29:07.540Z] /home/jenkins/workspace/Extragear/krita/kf5-qt5 SUSEQt5.10/benchmarks/kis_composition_benchmark.cpp:669:72: error: ���KoAlphaDarkenParamsWrapperCreamy��� was not declared in this scope
[2019-04-22T08:29:07.540Z] KoCompositeOp *opExp = new KoCompositeOpAlphaDarken<KoBgrU8Traits, KoAlphaDarkenParamsWrapperCreamy>(cs);
[2019-04-22T08:29:07.540Z] ^~~~~~~~~~~~~~~~~~~~~~~~~~~~~~~~
[2019-04-22T08:29:07.540Z] /home/jenkins/workspace/Extragear/krita/kf5-qt5 SUSEQt5.10/benchmarks/kis_composition_benchmark.cpp:669:104: error: template argument 2 is invalid
[2019-04-22T08:29:07.540Z] KoCompositeOp *opExp = new KoCompositeOpAlphaDarken<KoBgrU8Traits, KoAlphaDarkenParamsWrapperCreamy>(cs);
[2019-04-22T08:29:07.540Z] ^
[2019-04-22T08:29:07.540Z] /home/jenkins/workspace/Extragear/krita/kf5-qt5 SUSEQt5.10/benchmarks/kis_composition_benchmark.cpp: In member function ���void KisCompositionBenchmark::testRgb8CompositeAlphaDarkenLegacy()���:
[2019-04-22T08:29:07.540Z] /home/jenkins/workspace/Extragear/krita/kf5-qt5 SUSEQt5.10/benchmarks/kis_composition_benchmark.cpp:716:69: error: ���KoAlphaDarkenParamsWrapperCreamy��� was not declared in this scope
[2019-04-22T08:29:07.540Z] KoCompositeOp *op = new KoCompositeOpAlphaDarken<KoBgrU8Traits, KoAlphaDarkenParamsWrapperCreamy>(cs);
[2019-04-22T08:29:07.540Z] ^~~~~~~~~~~~~~~~~~~~~~~~~~~~~~~~
[2019-04-22T08:29:07.540Z] /home/jenkins/workspace/Extragear/krita/kf5-qt5 SUSEQt5.10/benchmarks/kis_composition_benchmark.cpp:716:101: error: template argument 2 is invalid
[2019-04-22T08:29:07.540Z] KoCompositeOp *op = new KoCompositeOpAlphaDarken<KoBgrU8Traits, KoAlphaDarkenParamsWrapperCreamy>(cs);
[2019-04-22T08:29:07.540Z] ^
[2019-04-22T08:29:07.540Z] /home/jenkins/workspace/Extragear/krita/kf5-qt5 SUSEQt5.10/benchmarks/kis_composition_benchmark.cpp: In member function ���void KisCompositionBenchmark::testRgbF32CompositeAlphaDarkenLegacy()���:
[2019-04-22T08:29:07.540Z] /home/jenkins/workspace/Extragear/krita/kf5-qt5 SUSEQt5.10/benchmarks/kis_composition_benchmark.cpp:748:70: error: ���KoAlphaDarkenParamsWrapperCreamy��� was not declared in this scope
[2019-04-22T08:29:07.540Z] KoCompositeOp *op = new KoCompositeOpAlphaDarken<KoRgbF32Traits, KoAlphaDarkenParamsWrapperCreamy>(cs);
[2019-04-22T08:29:07.540Z] ^~~~~~~~~~~~~~~~~~~~~~~~~~~~~~~~
[2019-04-22T08:29:07.540Z] /home/jenkins/workspace/Extragear/krita/kf5-qt5 SUSEQt5.10/benchmarks/kis_composition_benchmark.cpp:748:102: error: template argument 2 is invalid
[2019-04-22T08:29:07.540Z] KoCompositeOp *op = new KoCompositeOpAlphaDarken<KoRgbF32Traits, KoAlphaDarkenParamsWrapperCreamy>(cs);
[2019-04-22T08:29:07.540Z] ^
[2019-04-22T08:29:07.540Z] make[2]: * [benchmarks/CMakeFiles/KisCompositionBenchmark.dir/build.make:63: benchmarks/CMakeFiles/KisCompositionBenchmark.dir/kis_composition_benchmark.cpp.o] Error 1
[2019-04-22T08:29:07.540Z] make[1]:
* [CMakeFiles/Makefile2:44556: benchmarks/CMakeFiles/KisCompositionBenchmark.dir/all] Error 2
[2019-04-22T08:29:07.540Z] make: *** [Makefile:141: all] Error 2

Details

Committed
remptApr 22 2019, 11:00 AM
Parents
R37:d47ece40309f: Fix crash when merging back split alpha
Branches
Unknown
Tags
Unknown